error when compiling control-center


When I try to compile control-center 1.0.51, I get an errormessage saying:

callbacks.c: In function `timer_cb':
callbacks.c:371: `INT_MAX' undeclared (first use this function)
callbacks.c:371: (Each undeclared identifier is reported only once
callbacks.c:371: for each function it appears in.)
make[4]: *** [callbacks.o] Error 1
make[3]: *** [all-recursive] Error 1
make[2]: *** [all-recursive] Error 1
make[1]: *** [all-recursive] Error 1
make: *** [all-recursive-am] Error 2

What might be causing this?
If you need more info then this, just ask.

Andreas Berglund

[Date Prev][Date Next]   [Thread Prev][Thread Next]   [Thread Index] [Date Index] [Author Index]