ORBit doesn;t compile on IRIX 6.5.8m

Hi there,

I;ve looked at the faq and the archives and found no solutions. Anybody
have a solution for this:

Making all in interface_repository
gmake[4]: Entering directory
/bin/sh ../../../libtool --mode=link gcc  -g -O2  -o orbit-ird -static
interface_repository-skels.o interface_repository-impl.o
../../../src/orb/libORBit.la    ../../../src/IIOP/libIIOP.la   
../../../src/ORBitutil/libORBitutil.la  -L/usr/local/lib -lglib        
gcc -g -O2 -o orbit-ird interface_repository-skels.o
interface_repository-impl.o ../../../src/orb/.libs/libORBit.a
-L/usr/local/lib -lglib -lm ../../../src/IIOP/.libs/libIIOP.a
../../../src/ORBitutil/.libs/libORBitutil.a -L/usr/local/lib -lglib -lm
ld32: ERROR 33: Unresolved text symbol "iiop_byteswap" -- 1st referenced
by ../../../src/IIOP/.libs/libIIOP.a(giop-msg-buffer.o).
        Use linker option -v to see when and which objects, archives and
dsos are loaded.  
ld32: INFO 152: Output file removed because of error.
collect2: ld returned 2 exit status
gmake[4]: *** [orbit-ird] Error 1
gmake[4]: Leaving directory
gmake[3]: *** [all-recursive] Error 1
gmake[3]: Leaving directory
gmake[2]: *** [all-recursive] Error 1
gmake[2]: Leaving directory `/mnt/disk2/avi/tmp/src/ORBit-0.5.0/src'
gmake[1]: *** [all-recursive] Error 1
gmake[1]: Leaving directory `/mnt/disk2/avi/tmp/src/ORBit-0.5.0'
gmake: *** [all-recursive-am] Error 2
root@aragorn:~/tmp/src/ORBit-0.5.0 > 

0.5.1 dies in a similar fashion, with the same type of error but earlier
- in idl-compilers/backends/c

any help much is appreciated. 

avi bercovich

PS. I don;t subscrib eto this list, so you might consider mailing to my
e-mail adress: bercovic@swi.psy.uva.nl

[Date Prev][Date Next]   [Thread Prev][Thread Next]   [Thread Index] [Date Index] [Author Index]